Reaction Details
TargetHistamine H3 receptor
LigandBDBM50070214
Substrate/Competitorn/a
Meas. Tech.ChEMBL_86897 (CHEMBL698407)
Ki 0.8±n/a nM
Citation Ali, SMTedford, CEGregory, RHandley, MKYates, SLHirth, WWPhillips, JG Design, synthesis, and structure-activity relationships of acetylene-based histamine H3 receptor antagonists. J Med Chem42:903-9 (1999) 
 
Histamine H3 receptor
Name:Histamine H3 receptor
Type:G Protein-Coupled Receptor (GPCR)
Mol. Mass.:48607.98
Organism:Rattus norvegicus (rat)
Description:n/a
Residue:445
BDBM50070214
NameBDBM50070214
Synonyms:4-(7,7-Dimethyl-oct-3-ynyl)-1H-imidazole GT 2293
TypeSmall organic molecule
Emp. Form.C13H20N2
Mol. Mass.204.3113
SMILESCC(C)(C)CCC#CCCc1cnc[nH]1