Reaction Details
TargetIntegrin alpha-4/beta-1
LigandBDBM50074661
Substrate/Competitorn/a
Meas. Tech.ChEMBL_217448 (CHEMBL823497)
IC50 4±n/a nM
Citation Lin, KAteeq, HSHsiung, SHChong, LTZimmerman, CNCastro, ALee, WCHammond, CEKalkunte, SChen, LLPepinsky, RBLeone, DRSprague, AGAbraham, WMGill, ALobb, RRAdams, SP Selective, tight-binding inhibitors of integrin alpha4beta1 that inhibit allergic airway responses. J Med Chem42:920-34 (1999) 
 
Integrin alpha-4/beta-1
Name:Integrin alpha-4/beta-1
Type:n/a
Mol. Mass.:n/a
Description:ASSAY_ID of EBI is 88912
Components:This complex has 2 components.
Component 1
Name:Integrin beta-1
Synonyms:CD_antigen=CD29 Fibronectin receptor beta GPIIA ITGB1 MDF2 | MSK12
Type:Enzyme
Mol. Mass.:88400.38
Organism:Homo sapiens (Human)
Description:P05556
Residue:798
Component 2
Name:Integrin alpha-4
Synonyms:CD49 antigen-like family member D CD49d antigen ITA4_HUMAN Integrin alpha-4 Integrin alpha-IV VLA-4 integrin alpha 4 precursor | integrin alpha-4 precursor
Type:Membrane Protein
Mol. Mass.:114897.35
Organism:Homo sapiens (Human)
Description:P13612
Residue:1032
BDBM50074661
NameBDBM50074661
Synonyms:(S)-1-{(S)-2-[(S)-3-Carboxy-2-((S)-4-methyl-2-{2-[4-(3-o-tolyl-ureido)-phenyl]-acetylamino}-pentanoylamino)-propionylamino]-3-methyl-butyryl}-pyrrolidine-2-carboxylic acid CHEMBL88478
TypeSmall organic molecule
Emp. Form.C36H48N6O9
Mol. Mass.708.8011
SMILESCC(C)C[C@H](NC(=O)Cc1ccc(NC(=O)Nc2ccccc2C)cc1)C(=O)N[C@@H](CC(O)=O)C(=O)N[C@@H](C(C)C)C(=O)N1CCC[C@H]1C(O)=O