Reaction Details
TargetTyrosine-protein kinase ABL1
LigandBDBM50520734
Substrate/Competitorn/a
Meas. Tech.ChEMBL_1882013 (CHEMBL4383512)
IC50 0.200000±n/a nM
Citation Liu, XWang, BChen, CJiang, ZHu, CWu, HZhang, YLiu, XWang, WWang, JHu, ZWang, AHuang, TLiu, QWang, WWang, LWang, WRen, TLi, LXia, RGe, JLiu, QLiu, J Discovery of (E)-N-(4-((4-methylpiperazin-1-yl)methyl)-3-(trifluoromethyl)phenyl)-3-((3-(2-(pyridin-2-yl)vinyl)-1H-indazol-6-yl)thio)propanamide (CHMFL-ABL-121) as a highly potent ABL kinase inhibitor capable of overcoming a variety of ABL mutants including T315I for chronic myeloid leukemia. Eur J Med Chem160:61-81 (2018) 
 
Tyrosine-protein kinase ABL1
Name:Tyrosine-protein kinase ABL1
Type:Enzyme
Mol. Mass.:122897.30
Organism:Homo sapiens (Human)
Description:P00519
Residue:1130
BDBM50520734
NameBDBM50520734
Synonyms:CHEMBL4439424
TypeSmall organic molecule
Emp. Form.C30H31F3N6OS
Mol. Mass.580.667
SMILESCN1CCN(Cc2ccc(NC(=O)CCSc3ccc4c(\C=C\c5ccccn5)n[nH]c4c3)cc2C(F)(F)F)CC1