Reaction Details
TargetCapsid scaffolding protein
LigandBDBM50075173
Substrate/Competitorn/a
Meas. Tech.ChEBML_43065
IC50 29±n/a nM
Citation Pinto, ILJarvest, RLClarke, BDabrowski, CEFenwick, AGorczyca, MMJennings, LJLavery, PSternberg, EJTew, DGWest, A Inhibition of human cytomegalovirus protease by enedione derivatives of thieno[2,3-d]oxazinones through a novel dual acylation/alkylation mechanism. Bioorg Med Chem Lett9:449-52 (1999) Capsid scaffolding protein
Name:Capsid scaffolding protein
Type:PROTEIN
Mol. Mass.:73854.16
Organism:Human cytomegalovirus (strain AD169) (HHV-5) (Human herpesvirus 5)
Description:ChEMBL_158958
Residue:708
BDBM50075173
NameBDBM50075173
Synonyms:(E)-4-(3-Methoxy-phenyl)-4-oxo-but-2-enoic acid [(S)-1-(5-methyl-4-oxo-4H-thieno[2,3-d][1,3]oxazin-2-yl)-ethyl]-amide | CHEMBL140485
TypeSmall organic molecule
Emp. Form.C20H18N2O5S
Mol. Mass.398.432
SMILESCOc1cccc(c1)C(=O)\C=C\C(=O)N[C@@H](C)c1nc2scc(C)c2c(=O)o1