Reaction Details
TargetCapsid scaffolding protein
LigandBDBM50075177
Substrate/Competitorn/a
Meas. Tech.ChEBML_43065
IC50 41±n/a nM
Citation Pinto, ILJarvest, RLClarke, BDabrowski, CEFenwick, AGorczyca, MMJennings, LJLavery, PSternberg, EJTew, DGWest, A Inhibition of human cytomegalovirus protease by enedione derivatives of thieno[2,3-d]oxazinones through a novel dual acylation/alkylation mechanism. Bioorg Med Chem Lett9:449-52 (1999) Capsid scaffolding protein
Name:Capsid scaffolding protein
Type:PROTEIN
Mol. Mass.:73854.16
Organism:Human cytomegalovirus (strain AD169) (HHV-5) (Human herpesvirus 5)
Description:ChEMBL_158958
Residue:708
BDBM50075177
NameBDBM50075177
Synonyms:(E)-4-(3-Cyano-phenyl)-4-oxo-but-2-enoic acid [(S)-1-(5-methyl-4-oxo-4H-thieno[2,3-d][1,3]oxazin-2-yl)-ethyl]-amide | CHEMBL141684
TypeSmall organic molecule
Emp. Form.C20H15N3O4S
Mol. Mass.393.416
SMILESC[C@H](NC(=O)\C=C\C(=O)c1cccc(c1)C#N)c1nc2scc(C)c2c(=O)o1