Reaction Details
TargetIntegrin alpha-IIb/beta-3
LigandBDBM50075566
Substrate/Competitorn/a
Meas. Tech.ChEMBL_70168 (CHEMBL683388)
Kd 0.600000±n/a nM
Citation Olson, RESielecki, TMWityak, JPinto, DJBatt, DGFrietze, WELiu, JTobin, AEOrwat, MJDi Meo, SVHoughton, GCLalka, GKMousa, SARacanelli, ALHausner, EAKapil, RPRabel, SRThoolen, MJReilly, TMAnderson, PSWexler, RR Orally active isoxazoline glycoprotein IIb/IIIa antagonists with extended duration of action. J Med Chem42:1178-92 (1999) 
 
Integrin alpha-IIb/beta-3
Name:Integrin alpha-IIb/beta-3
Synonyms:Glycoprotein IIb/IIIa
Type:n/a
Mol. Mass.:n/a
Description:ASSAY_ID of EBI is 30109
Components:This complex has 2 components.
Component 1
Name:Integrin beta-3
Type:Protein
Mol. Mass.:87038.91
Organism:Homo sapiens (Human)
Description:P05106
Residue:788
Component 2
Name:Integrin alpha-IIb
Synonyms:CD_antigen=CD41 GPIIb Glycoprotein IIb ITGA2B Integrin alpha-IIb heavy chain Integrin alpha-IIb light chain, form 2 Integrin alpha-V/beta-3 and alpha-IIb/beta 3 | Platelet membrane glycoprotein IIb
Type:Protein
Mol. Mass.:113354.85
Organism:Homo sapiens (Human)
Description:P08514
Residue:1039
BDBM50075566
NameBDBM50075566
Synonyms:(S)-3-{2-[(R)-3-(4-Carbamimidoyl-phenyl)-4,5-dihydro-isoxazol-5-yl]-acetylamino}-2-(3,5-dimethyl-isoxazole-4-sulfonylamino)-propionic acid; compound with methanesulfonic acid CHEMBL275611
TypeSmall organic molecule
Emp. Form.C20H24N6O7S
Mol. Mass.492.506
SMILESCc1noc(C)c1S(=O)(=O)N[C@@H](CNC(=O)C[C@H]1CC(=NO1)c1ccc(cc1)C(N)=N)C(O)=O