Reaction Details
TargetOxytocin receptor
LigandBDBM50075722
Substrate/Competitorn/a
Meas. Tech.ChEMBL_149052 (CHEMBL761407)
Ki 1.6±n/a nM
Citation Durroux, TPeter, MTurcatti, GChollet, ABalestre, MNBarberis, CSeyer, R Fluorescent pseudo-peptide linear vasopressin antagonists: design, synthesis, and applications. J Med Chem42:1312-9 (1999) 
 
Oxytocin receptor
Name:Oxytocin receptor
Type:Enzyme Catalytic Domain
Mol. Mass.:42793.26
Organism:Homo sapiens (Human)
Description:Oxytocin OXTR HEK293::B2R9L7
Residue:389
BDBM50075722
NameBDBM50075722
Synonyms:4HOPh(CH2)2CO-DTyr(Me)-Phe-Gln-Asn-Arg-Pro-Lys(5C-Flu)-NH2 | CHEMBL412210
TypeSmall organic molecule
Emp. Form.C75H86N14O18
Mol. Mass.1471.5683
SMILESCN([C@H](Cc1ccc(O)cc1)C(=O)N[C@@H](Cc1ccccc1)C(=O)N[C@@H](CCC(N)=O)C(=O)N[C@@H](CC(N)=O)C(=O)N[C@@H](CCCNC(N)=N)C(=O)N1CCC[C@H]1C(=O)N([C@@H](CCCCN)C(N)=O)C(=O)c1ccc2c(c1)C(=O)OC21c2ccc(O)cc2Oc2cc(O)ccc12)C(=O)CCc1ccc(O)cc1