Reaction Details
TargetProthrombin
LigandBDBM50073298
Substrate/Competitorn/a
Meas. Tech.ChEBML_208353
Ki 22±n/a nM
Citation Ambler, JBaker, EBentley, DBrown, LButler, KButler, PFarr, DDunnet, KLe Grand, DHayler, JJanus, DJones, DMenear, KMercer, MSmith, GTalbot, MTweed, M Studies towards the identification of potent, selective and bioavailable thrombin inhibitors. Bioorg Med Chem Lett9:737-42 (1999) Prothrombin
Name:Prothrombin
Type:Protein
Mol. Mass.:70029.57
Organism:Homo sapiens (Human)
Description:P00734
Residue:622
BDBM50073298
NameBDBM50073298
Synonyms:4-((S)-1-Benzyl-2-morpholin-4-yl-ethylamino)-pyridine-3-sulfonic acid {(S)-1-(4-amino-benzyl)-2-[4-(2-fluoro-ethyl)-piperidin-1-yl]-2-oxo-ethyl}-amide CHEMBL118159
TypeSmall organic molecule
Emp. Form.C34H45FN6O4S
Mol. Mass.652.822
SMILESNc1ccc(C[C@H](NS(=O)(=O)c2cnccc2N[C@H](CN2CCOCC2)Cc2ccccc2)C(=O)N2CCC(CCF)CC2)cc1