Reaction Details
TargetProthrombin
LigandBDBM50075868
Substrate/Competitorn/a
Meas. Tech.ChEBML_208353
Ki 62±n/a nM
Citation Ambler, JBaker, EBentley, DBrown, LButler, KButler, PFarr, DDunnet, KLe Grand, DHayler, JJanus, DJones, DMenear, KMercer, MSmith, GTalbot, MTweed, M Studies towards the identification of potent, selective and bioavailable thrombin inhibitors. Bioorg Med Chem Lett9:737-42 (1999) Prothrombin
Name:Prothrombin
Type:Protein
Mol. Mass.:70029.57
Organism:Homo sapiens (Human)
Description:P00734
Residue:622
BDBM50075868
NameBDBM50075868
Synonyms:4-((S)-1-Morpholin-4-ylmethyl-2-phenyl-ethylamino)-pyridine-3-sulfonic acid [(S)-1-(4-amino-benzyl)-2-(4-ethyl-piperidin-1-yl)-2-oxo-ethyl]-amide | CHEMBL164518
TypeSmall organic molecule
Emp. Form.C34H46N6O4S
Mol. Mass.634.832
SMILESCCC1CCN(CC1)C(=O)[C@H](Cc1ccc(N)cc1)NS(=O)(=O)c1cnccc1N[C@H](CN1CCOCC1)Cc1ccccc1