Reaction Details
TargetProthrombin
LigandBDBM50075869
Substrate/Competitorn/a
Meas. Tech.ChEMBL_208353 (CHEMBL813663)
Ki 147±n/a nM
Citation Ambler, JBaker, EBentley, DBrown, LButler, KButler, PFarr, DDunnet, KLe Grand, DHayler, JJanus, DJones, DMenear, KMercer, MSmith, GTalbot, MTweed, M Studies towards the identification of potent, selective and bioavailable thrombin inhibitors. Bioorg Med Chem Lett9:737-42 (1999) Prothrombin
Name:Prothrombin
Type:Protein
Mol. Mass.:70029.57
Organism:Homo sapiens (Human)
Description:P00734
Residue:622
BDBM50075869
NameBDBM50075869
Synonyms:4-[(S)-1-(2-Hydroxy-ethoxymethyl)-2-phenyl-ethylamino]-pyridine-3-sulfonic acid [(S)-1-(4-amino-benzyl)-2-(4-ethyl-piperidin-1-yl)-2-oxo-ethyl]-amide | CHEMBL164664
TypeSmall organic molecule
Emp. Form.C32H43N5O5S
Mol. Mass.609.779
SMILESCCC1CCN(CC1)C(=O)[C@H](Cc1ccc(N)cc1)NS(=O)(=O)c1cnccc1N[C@H](COCCO)Cc1ccccc1