Reaction Details
TargetProthrombin
LigandBDBM50073295
Substrate/Competitorn/a
Meas. Tech.ChEBML_208353
Ki 39±n/a nM
Citation Ambler, JBaker, EBentley, DBrown, LButler, KButler, PFarr, DDunnet, KLe Grand, DHayler, JJanus, DJones, DMenear, KMercer, MSmith, GTalbot, MTweed, M Studies towards the identification of potent, selective and bioavailable thrombin inhibitors. Bioorg Med Chem Lett9:737-42 (1999) Prothrombin
Name:Prothrombin
Type:Protein
Mol. Mass.:70029.57
Organism:Homo sapiens (Human)
Description:P00734
Residue:622
BDBM50073295
NameBDBM50073295
Synonyms:4-((S)-1-Hydroxymethyl-2-phenyl-ethylamino)-pyridine-3-sulfonic acid {(S)-1-(4-amino-benzyl)-2-[4-(2-fluoro-ethyl)-piperidin-1-yl]-2-oxo-ethyl}-amide | CHEMBL121452
TypeSmall organic molecule
Emp. Form.C30H38FN5O4S
Mol. Mass.583.717
SMILESNc1ccc(C[C@H](NS(=O)(=O)c2cnccc2N[C@H](CO)Cc2ccccc2)C(=O)N2CCC(CCF)CC2)cc1