Reaction Details
TargetProthrombin
LigandBDBM50073292
Substrate/Competitorn/a
Meas. Tech.ChEBML_208353
Ki 49±n/a nM
Citation Ambler, JBaker, EBentley, DBrown, LButler, KButler, PFarr, DDunnet, KLe Grand, DHayler, JJanus, DJones, DMenear, KMercer, MSmith, GTalbot, MTweed, M Studies towards the identification of potent, selective and bioavailable thrombin inhibitors. Bioorg Med Chem Lett9:737-42 (1999) Prothrombin
Name:Prothrombin
Type:Protein
Mol. Mass.:70029.57
Organism:Homo sapiens (Human)
Description:P00734
Residue:622
BDBM50073292
NameBDBM50073292
Synonyms:4-[(S)-1-(2-Hydroxy-ethoxymethyl)-2-phenyl-ethylamino]-pyridine-3-sulfonic acid {(S)-1-(4-amino-benzyl)-2-[4-(2-fluoro-ethyl)-piperidin-1-yl]-2-oxo-ethyl}-amide | CHEMBL120761
TypeSmall organic molecule
Emp. Form.C32H42FN5O5S
Mol. Mass.627.77
SMILESNc1ccc(C[C@H](NS(=O)(=O)c2cnccc2N[C@H](COCCO)Cc2ccccc2)C(=O)N2CCC(CCF)CC2)cc1