Reaction Details
TargetProthrombin
LigandBDBM50075871
Substrate/Competitorn/a
Meas. Tech.ChEBML_208353
Ki 61±n/a nM
Citation Ambler, JBaker, EBentley, DBrown, LButler, KButler, PFarr, DDunnet, KLe Grand, DHayler, JJanus, DJones, DMenear, KMercer, MSmith, GTalbot, MTweed, M Studies towards the identification of potent, selective and bioavailable thrombin inhibitors. Bioorg Med Chem Lett9:737-42 (1999) Prothrombin
Name:Prothrombin
Type:Protein
Mol. Mass.:70029.57
Organism:Homo sapiens (Human)
Description:P00734
Residue:622
BDBM50075871
NameBDBM50075871
Synonyms:4-[(S)-1-(4-Hydroxy-piperidin-1-ylmethyl)-2-phenyl-ethylamino]-pyridine-3-sulfonic acid {(S)-1-benzyl-2-[4-(2-fluoro-ethyl)-piperidin-1-yl]-2-oxo-ethyl}-amide | CHEMBL162002
TypeSmall organic molecule
Emp. Form.C35H46FN5O4S
Mol. Mass.651.834
SMILESOC1CCN(C[C@H](Cc2ccccc2)Nc2ccncc2S(=O)(=O)N[C@@H](Cc2ccccc2)C(=O)N2CCC(CCF)CC2)CC1