Reaction Details
TargetProthrombin
LigandBDBM50073281
Substrate/Competitorn/a
Meas. Tech.ChEBML_208353
Ki 110±n/a nM
Citation Ambler, JBaker, EBentley, DBrown, LButler, KButler, PFarr, DDunnet, KLe Grand, DHayler, JJanus, DJones, DMenear, KMercer, MSmith, GTalbot, MTweed, M Studies towards the identification of potent, selective and bioavailable thrombin inhibitors. Bioorg Med Chem Lett9:737-42 (1999) Prothrombin
Name:Prothrombin
Type:Protein
Mol. Mass.:70029.57
Organism:Homo sapiens (Human)
Description:P00734
Residue:622
BDBM50073281
NameBDBM50073281
Synonyms:4-((S)-1-Hydroxymethyl-2-phenyl-ethylamino)-pyridine-3-sulfonic acid [(S)-1-(4-amino-benzyl)-2-(4-ethyl-piperidin-1-yl)-2-oxo-ethyl]-amide | CHEMBL118545
TypeSmall organic molecule
Emp. Form.C30H39N5O4S
Mol. Mass.565.727
SMILESCCC1CCN(CC1)C(=O)[C@H](Cc1ccc(N)cc1)NS(=O)(=O)c1cnccc1N[C@H](CO)Cc1ccccc1