Reaction Details
TargetProthrombin
LigandBDBM50073301
Substrate/Competitorn/a
Meas. Tech.ChEBML_208353
Ki 100±n/a nM
Citation Ambler, JBaker, EBentley, DBrown, LButler, KButler, PFarr, DDunnet, KLe Grand, DHayler, JJanus, DJones, DMenear, KMercer, MSmith, GTalbot, MTweed, M Studies towards the identification of potent, selective and bioavailable thrombin inhibitors. Bioorg Med Chem Lett9:737-42 (1999) Prothrombin
Name:Prothrombin
Type:Protein
Mol. Mass.:70029.57
Organism:Homo sapiens (Human)
Description:P00734
Residue:622
BDBM50073301
NameBDBM50073301
Synonyms:4-((S)-1-Hydroxymethyl-2-phenyl-ethylamino)-pyridine-3-sulfonic acid {(S)-1-benzyl-2-[4-(2-fluoro-ethyl)-piperidin-1-yl]-2-oxo-ethyl}-amide | CHEMBL118905
TypeSmall organic molecule
Emp. Form.C30H37FN4O4S
Mol. Mass.568.703
SMILESOC[C@H](Cc1ccccc1)Nc1ccncc1S(=O)(=O)N[C@@H](Cc1ccccc1)C(=O)N1CCC(CCF)CC1