Reaction Details
TargetProthrombin
LigandBDBM50075875
Substrate/Competitorn/a
Meas. Tech.ChEBML_208353
Ki 130±n/a nM
Citation Ambler, JBaker, EBentley, DBrown, LButler, KButler, PFarr, DDunnet, KLe Grand, DHayler, JJanus, DJones, DMenear, KMercer, MSmith, GTalbot, MTweed, M Studies towards the identification of potent, selective and bioavailable thrombin inhibitors. Bioorg Med Chem Lett9:737-42 (1999) Prothrombin
Name:Prothrombin
Type:Protein
Mol. Mass.:70029.57
Organism:Homo sapiens (Human)
Description:P00734
Residue:622
BDBM50075875
NameBDBM50075875
Synonyms:4-((S)-1-Dimethylaminomethyl-2-phenyl-ethylamino)-pyridine-3-sulfonic acid {(S)-1-benzyl-2-[4-(2-fluoro-ethyl)-piperidin-1-yl]-2-oxo-ethyl}-amide | CHEMBL162426
TypeSmall organic molecule
Emp. Form.C32H42FN5O3S
Mol. Mass.595.771
SMILESCN(C)C[C@H](Cc1ccccc1)Nc1ccncc1S(=O)(=O)N[C@@H](Cc1ccccc1)C(=O)N1CCC(CCF)CC1