Reaction Details
TargetPlasmepsin II
LigandBDBM50076292
Substrate/Competitorn/a
Meas. Tech.ChEMBL_154909 (CHEMBL764684)
Ki 2±n/a nM
Citation Haque, TSSkillman, AGLee, CEHabashita, HGluzman, IYEwing, TJGoldberg, DEKuntz, IDEllman, JA Potent, low-molecular-weight non-peptide inhibitors of malarial aspartyl protease plasmepsin II. J Med Chem42:1428-40 (1999) 
 
Plasmepsin II
Name:Plasmepsin II
Type:Enzyme
Mol. Mass.:51482.09
Organism:Plasmodium falciparum
Description:P46925
Residue:453
BDBM50076292
NameBDBM50076292
Synonyms:1-Methyl-piperidine-4-carboxylic acid {(2S,3S)-3-[2-(3-chloro-phenoxy)-acetylamino]-2-hydroxy-4-phenyl-butyl}-[2-(4-methoxy-phenyl)-ethyl]-amide | CHEMBL285177
TypeSmall organic molecule
Emp. Form.C34H42ClN3O5
Mol. Mass.608.167
SMILESCOc1ccc(CCN(C[C@H](O)[C@H](Cc2ccccc2)NC(=O)COc2cccc(Cl)c2)C(=O)C2CCN(C)CC2)cc1