Reaction Details
Target5-hydroxytryptamine receptor 1A
LigandBDBM86708
Substrate/Competitorn/a
Meas. Tech.ChEMBL_937 (CHEMBL616302)
Ki 0.590000±n/a nM
Citation Lang, LJagoda, ESchmall, BVuong, BKAdams, HRNelson, DLCarson, REEckelman, WC Development of fluorine-18-labeled 5-HT1A antagonists. J Med Chem42:1576-86 (1999) 
 
5-hydroxytryptamine receptor 1A
Name:5-hydroxytryptamine receptor 1A
Type:n/a
Mol. Mass.:46122.49
Organism:Homo sapiens (Human)
Description:n/a
Residue:422
BDBM86708
NameBDBM86708
Synonyms:CAS_146714-97-8 CHEMBL514874 NSC_104911 | WAY 100,635
TypeSmall organic molecule
Emp. Form.C25H34N4O2
Mol. Mass.422.5631
SMILESCOc1ccccc1N1CCN(CCN(C(=O)C2CCCCC2)c2ccccn2)CC1