Reaction Details
Target5-hydroxytryptamine receptor 1A
LigandBDBM50076429
Substrate/Competitorn/a
Meas. Tech.ChEMBL_939 (CHEMBL616118)
Ki 0.791000±n/a nM
Citation Lang, LJagoda, ESchmall, BVuong, BKAdams, HRNelson, DLCarson, REEckelman, WC Development of fluorine-18-labeled 5-HT1A antagonists. J Med Chem42:1576-86 (1999) 
 
5-hydroxytryptamine receptor 1A
Name:5-hydroxytryptamine receptor 1A
Type:n/a
Mol. Mass.:46122.49
Organism:Homo sapiens (Human)
Description:n/a
Residue:422
BDBM50076429
NameBDBM50076429
Synonyms:4-Fluoro-N-{2-[4-(2-methoxy-phenyl)-piperazin-1-yl]-ethyl}-3-methyl-N-pyridin-2-yl-benzamide CHEMBL43297
TypeSmall organic molecule
Emp. Form.C26H29FN4O2
Mol. Mass.448.5325
SMILESCOc1ccccc1N1CCN(CCN(C(=O)c2ccc(F)c(C)c2)c2ccccn2)CC1