Reaction Details
TargetOxytocin receptor
LigandBDBM50077037
Substrate/Competitorn/a
Meas. Tech.ChEBML_149046
Ki 1.4±n/a nM
Citation Williams, PDBock, MGEvans, BEFreidinger, RMGallicchio, SNGuidotti, MTJacobson, MAKuo, MSLevy, MRLis, EVMichelson, SRPawluczyk, JMPerlow, DSPettibone, DJQuigley, AGReiss, DRSalvatore, CStauffer, KJWoyden, CJ Nonpeptide oxytocin antagonists: analogs of L-371,257 with improved potency. Bioorg Med Chem Lett9:1311-6 (1999) Oxytocin receptor
Name:Oxytocin receptor
Type:Enzyme Catalytic Domain
Mol. Mass.:42793.26
Organism:Homo sapiens (Human)
Description:Oxytocin OXTR HEK293::B2R9L7
Residue:389
BDBM50077037
NameBDBM50077037
Synonyms:1-(1-{2-[4-(2-Morpholin-4-yl-ethoxy)-2-(2,2,2-trifluoro-ethoxy)-phenyl]-acetyl}-piperidin-4-yl)-1,4-dihydro-benzo[d][1,3]oxazin-2-one | CHEMBL278818
TypeSmall organic molecule
Emp. Form.C29H34F3N3O6
Mol. Mass.577.592
SMILESFC(F)(F)COc1cc(OCCN2CCOCC2)ccc1CC(=O)N1CCC(CC1)N1C(=O)OCc2ccccc12