Reaction Details
TargetCoagulation factor X
LigandBDBM50077190
Substrate/Competitorn/a
Meas. Tech.ChEMBL_48800 (CHEMBL838886)
Ki 12±n/a nM
Citation Phillips, GDavey, DDEagen, KAKoovakkat, SKLiang, ANg, HPPinkerton, MTrinh, LWhitlow, MBeatty, AMMorrissey, MM Design, synthesis, and activity of 2,6-diphenoxypyridine-derived factor Xa inhibitors. J Med Chem42:1749-56 (1999) 
 
Coagulation factor X
Name:Coagulation factor X
Type:Enzyme
Mol. Mass.:54726.60
Organism:Homo sapiens (Human)
Description:n/a
Residue:488
BDBM50077190
NameBDBM50077190
Synonyms:2N-[3-amino(imino)methylphenyl]-2N,4-dimethyl-6-[3-amino(imino)methylphenoxy]-3,5-difluoro-2-pyridinamine | CHEMBL52205
TypeSmall organic molecule
Emp. Form.C21H20F2N6O
Mol. Mass.410.4199
SMILESCN(c1cccc(c1)C(N)=N)c1nc(Oc2cccc(c2)C(N)=N)c(F)c(C)c1F