Reaction Details
TargetCoagulation factor X
LigandBDBM17278
Substrate/Competitorn/a
Meas. Tech.ChEMBL_48800 (CHEMBL838886)
Ki 13±n/a nM
Citation Phillips, GDavey, DDEagen, KAKoovakkat, SKLiang, ANg, HPPinkerton, MTrinh, LWhitlow, MBeatty, AMMorrissey, MM Design, synthesis, and activity of 2,6-diphenoxypyridine-derived factor Xa inhibitors. J Med Chem42:1749-56 (1999) 
 
Coagulation factor X
Name:Coagulation factor X
Type:Enzyme
Mol. Mass.:54726.60
Organism:Homo sapiens (Human)
Description:n/a
Residue:488
BDBM17278
NameBDBM17278
Synonyms:3-{[6-(3-carbamimidoylphenoxy)-3,5-difluoro-4-methylpyridin-2-yl]oxy}benzene-1-carboximidamide Pyridine template, III | ZK-805623
TypeSmall organic molecule
Emp. Form.C20H17F2N5O2
Mol. Mass.397.3781
SMILESCc1c(F)c(Oc2cccc(c2)C(N)=N)nc(Oc2cccc(c2)C(N)=N)c1F