Reaction Details
TargetEpidermal growth factor receptor
LigandBDBM50077246
Substrate/Competitorn/a
Meas. Tech.ChEMBL_64443 (CHEMBL674018)
IC50 0.540000±n/a nM
Citation Smaill, JBPalmer, BDRewcastle, GWDenny, WAMcNamara, DJDobrusin, EMBridges, AJZhou, HShowalter, HDWinters, RTLeopold, WRFry, DWNelson, JMSlintak, VElliot, WLRoberts, BJVincent, PWPatmore, SJ Tyrosine kinase inhibitors. 15. 4-(Phenylamino)quinazoline and 4-(phenylamino)pyrido[d]pyrimidine acrylamides as irreversible inhibitors of the ATP binding site of the epidermal growth factor receptor. J Med Chem42:1803-15 (1999) 
 
Epidermal growth factor receptor
Name:Epidermal growth factor receptor
Type:Receptor Kinase Domain
Mol. Mass.:134279.59
Organism:Homo sapiens (Human)
Description:P00533
Residue:1210
BDBM50077246
NameBDBM50077246
Synonyms:CHEMBL49986 | N-[4-(3-Bromo-phenylamino)-pyrido[4,3-d]pyrimidin-7-yl]-acrylamide
TypeSmall organic molecule
Emp. Form.C16H12BrN5O
Mol. Mass.370.203
SMILESBrc1cccc(Nc2ncnc3cc(NC(=O)C=C)ncc23)c1