Reaction Details
TargetEpidermal growth factor receptor
LigandBDBM50077231
Substrate/Competitorn/a
Meas. Tech.ChEMBL_64442 (CHEMBL674017)
IC50 2.1±n/a nM
Citation Smaill, JBPalmer, BDRewcastle, GWDenny, WAMcNamara, DJDobrusin, EMBridges, AJZhou, HShowalter, HDWinters, RTLeopold, WRFry, DWNelson, JMSlintak, VElliot, WLRoberts, BJVincent, PWPatmore, SJ Tyrosine kinase inhibitors. 15. 4-(Phenylamino)quinazoline and 4-(phenylamino)pyrido[d]pyrimidine acrylamides as irreversible inhibitors of the ATP binding site of the epidermal growth factor receptor. J Med Chem42:1803-15 (1999) 
 
Epidermal growth factor receptor
Name:Epidermal growth factor receptor
Type:Receptor Kinase Domain
Mol. Mass.:134279.59
Organism:Homo sapiens (Human)
Description:P00533
Residue:1210
BDBM50077231
NameBDBM50077231
Synonyms:CHEMBL54091 | N-[4-(3-Bromo-4-fluoro-phenylamino)-pyrido[3,4-d]pyrimidin-6-yl]-acrylamide
TypeSmall organic molecule
Emp. Form.C16H11BrFN5O
Mol. Mass.388.194
SMILESFc1ccc(Nc2ncnc3cnc(NC(=O)C=C)cc23)cc1Br