Reaction Details
TargetReceptor tyrosine-protein kinase erbB-2
LigandBDBM50077242
Substrate/Competitorn/a
Meas. Tech.ChEMBL_65258 (CHEMBL673949)
IC50 4.3±n/a nM
Citation Smaill, JBPalmer, BDRewcastle, GWDenny, WAMcNamara, DJDobrusin, EMBridges, AJZhou, HShowalter, HDWinters, RTLeopold, WRFry, DWNelson, JMSlintak, VElliot, WLRoberts, BJVincent, PWPatmore, SJ Tyrosine kinase inhibitors. 15. 4-(Phenylamino)quinazoline and 4-(phenylamino)pyrido[d]pyrimidine acrylamides as irreversible inhibitors of the ATP binding site of the epidermal growth factor receptor. J Med Chem42:1803-15 (1999) 
 
Receptor tyrosine-protein kinase erbB-2
Name:Receptor tyrosine-protein kinase erbB-2
Type:n/a
Mol. Mass.:137894.47
Organism:Homo sapiens (Human)
Description:P04626
Residue:1255
BDBM50077242
NameBDBM50077242
Synonyms:CHEMBL31373 | N-[4-(3-Chloro-4-fluoro-phenylamino)-quinazolin-6-yl]-acrylamide
TypeSmall organic molecule
Emp. Form.C17H12ClFN4O
Mol. Mass.342.755
SMILESFc1ccc(Nc2ncnc3ccc(NC(=O)C=C)cc23)cc1Cl