Reaction Details
TargetBeta-2 adrenergic receptor
LigandBDBM50077647
Substrate/Competitorn/a
Meas. Tech.ChEBML_38460
Kd 51±n/a nM
Citation Suzuki, HShindo, KUeno, AMiura, TTakei, MSakakibara, MFukamachi, HTanaka, JHiga, T S1319: a novel beta2-andrenoceptor agonist from a marine sponge Dysidea sp. Bioorg Med Chem Lett9:1361-4 (1999) Beta-2 adrenergic receptor
Name:Beta-2 adrenergic receptor
Type:n/a
Mol. Mass.:46461.69
Organism:Homo sapiens (Human)
Description:P07550
Residue:413
BDBM50077647
NameBDBM50077647
Synonyms:4-Hydroxy-7-(1-hydroxy-2-methylamino-ethyl)-3H-benzothiazol-2-one CHEMBL29141
TypeSmall organic molecule
Emp. Form.C10H12N2O3S
Mol. Mass.240.279
SMILESCNCC(O)c1ccc(O)c2[nH]c(=O)sc12