Reaction Details
TargetNeuraminidase
LigandBDBM4707
Substrate/Competitorn/a
Meas. Tech.ChEMBL_144722 (CHEMBL750943)
Ki 2.5±n/a nM
Citation Atigadda, VRBrouillette, WJDuarte, FAli, SMBabu, YSBantia, SChand, PChu, NMontgomery, JAWalsh, DASudbeck, EAFinley, JLuo, MAir, GMLaver, GW Potent inhibition of influenza sialidase by a benzoic acid containing a 2-pyrrolidinone substituent. J Med Chem42:2332-43 (1999) 
 
Neuraminidase
Name:Neuraminidase
Type:Enzyme
Mol. Mass.:51446.67
Organism:Influenza B virus (B/Lee/40)
Description:n/a
Residue:466
BDBM4707
NameBDBM4707
Synonyms:3-(2,2-diaminoimino)-4-methylcarboxamidobenzoate 4-Acetylamino-3-guanidino-benzoic acid BANA 113 | CHEMBL55440
TypeSmall organic molecule
Emp. Form.C10H12N4O3
Mol. Mass.236.2273
SMILES[#6]-[#6](=O)-[#7]-c1ccc(cc1\[#7]=[#6](/[#7])-[#7])-[#6](-[#8])=O