Reaction Details
TargetCorticotropin-releasing factor receptor 1
LigandBDBM50054239
Substrate/Competitorn/a
Meas. Tech.ChEMBL_50976 (CHEMBL663519)
Ki 1050±n/a nM
Citation Keller, PABowman, MDang, KHGarner, JLeach, SPSmith, RMcCluskey, A Pharmacophore development for corticotropin-releasing hormone: new insights into inhibitor activity. J Med Chem42:2351-7 (1999) 
 
Corticotropin-releasing factor receptor 1
Name:Corticotropin-releasing factor receptor 1
Type:Enzyme
Mol. Mass.:50744.31
Organism:Homo sapiens (Human)
Description:P34998
Residue:444
BDBM50054239
NameBDBM50054239
Synonyms:CHEMBL78035 | [4-(3,6-Dihydro-2H-pyridin-1-yl)-6-methyl-[1,3,5]triazin-2-yl]-(2,4,6-trimethyl-phenyl)-amine
TypeSmall organic molecule
Emp. Form.C18H23N5
Mol. Mass.309.4087
SMILESCc1cc(C)c(Nc2nc(C)nc(n2)N2CCC=CC2)c(C)c1