Reaction Details
TargetCorticotropin-releasing factor receptor 1
LigandBDBM50054219
Substrate/Competitorn/a
Meas. Tech.ChEMBL_50976 (CHEMBL663519)
Ki 1050±n/a nM
Citation Keller, PABowman, MDang, KHGarner, JLeach, SPSmith, RMcCluskey, A Pharmacophore development for corticotropin-releasing hormone: new insights into inhibitor activity. J Med Chem42:2351-7 (1999) 
 
Corticotropin-releasing factor receptor 1
Name:Corticotropin-releasing factor receptor 1
Type:Enzyme
Mol. Mass.:50744.31
Organism:Homo sapiens (Human)
Description:P34998
Residue:444
BDBM50054219
NameBDBM50054219
Synonyms:CHEMBL305671 | N-Benzyl-N-butyl-6-methyl-N'-(2,4,6-trimethyl-phenyl)-[1,3,5]triazine-2,4-diamine
TypeSmall organic molecule
Emp. Form.C24H31N5
Mol. Mass.389.5364
SMILESCCCCN(Cc1ccccc1)c1nc(C)nc(Nc2c(C)cc(C)cc2C)n1