Reaction Details
TargetNeutrophil collagenase
LigandBDBM8465
Substrate/Competitorn/a
Meas. Tech.ChEMBL_1891528 (CHEMBL4393355)
IC50 11±n/a nM
Citation Kalinin, DVAgoglitta, OVan de Vyver, HMelesina, JWagner, SRiemann, BSchäfers, MSippl, WLöffler, BHoll, R Proline-based hydroxamates targeting the zinc-dependent deacetylase LpxC: Synthesis, antibacterial properties, and docking studies. Bioorg Med Chem27:1997-2018 (2019) 
 
Neutrophil collagenase
Name:Neutrophil collagenase
Type:Enzyme
Mol. Mass.:53413.48
Organism:Homo sapiens (Human)
Description:P22894
Residue:467
BDBM8465
NameBDBM8465
Synonyms:(2R)-N-hydroxy-2-[(4-methoxybenzene)(pyridin-3-ylmethyl)sulfonamido]-3-methylbutanamide CGS 27023 CHEMBL514138 | hydroxamate analogue 1
TypeSmall organic molecule
Emp. Form.C18H23N3O5S
Mol. Mass.393.457
SMILESCOc1ccc(cc1)S(=O)(=O)N(Cc1cccnc1)[C@H](C(C)C)C(=O)NO