Reaction Details
TargetSterol O-acyltransferase 1
LigandBDBM50079716
Substrate/Competitorn/a
Meas. Tech.ChEMBL_28013 (CHEMBL641212)
IC50 36±n/a nM
Citation Matsuyama, NKosaka, TFukuhara, MSoda, YMizuno, K Polyunsaturated fatty acid anilides as inhibitors of acyl-coA: cholesterol acyltransferase (ACAT). Bioorg Med Chem Lett9:2039-42 (1999) Sterol O-acyltransferase 1
Name:Sterol O-acyltransferase 1
Type:Multi-pass membrane protein may form homo- or heterodimers.
Mol. Mass.:64751.94
Organism:Homo sapiens (Human)
Description:P35610
Residue:550
BDBM50079716
NameBDBM50079716
Synonyms:(5E,8E,11E,14E,17E,20E)-Docosa-5,8,11,14,17,20-hexaenoic acid (2,6-diisopropyl-phenyl)-amide | CHEMBL304267
TypeSmall organic molecule
Emp. Form.C34H49NO
Mol. Mass.487.759
SMILESC\C=C\C\C=C\C\C=C\C\C=C\C\C=C\C\C=C\CCCC(=O)Nc1c(cccc1C(C)C)C(C)C