Reaction Details
TargetProtein phosphatase 3 catalytic subunit alpha
LigandBDBM50079782
Substrate/Competitorn/a
Meas. Tech.ChEBML_42586
IC50 5.9±n/a nM
Citation Armstrong, HMWong, FHolmes, MASinclair, PJGoulet, MTDumont, FJStaruch, MJKoprak, SPeterson, LBRosa, RWilusz, MBWiederrecht, GJCryan, JGWyvratt, MJParsons, WH Potent immunosuppressive C32-O-arylethyl ether derivatives of ascomycin with reduced toxicity. Bioorg Med Chem Lett9:2089-94 (1999) Protein phosphatase 3 catalytic subunit alpha
Name:Protein phosphatase 3 catalytic subunit alpha
Type:Enzyme Catalytic Domain
Mol. Mass.:58681.14
Organism:Homo sapiens (Human)
Description:calcineurin 0 HUMAN::Q08209
Residue:521
BDBM50079782
NameBDBM50079782
Synonyms:17-Ethyl-1,14-dihydroxy-12-(2-{4-[2-hydroxy-2-(3-trifluoromethyl-phenyl)-ethoxy]-3-methoxy-cyclohexyl}-1-methyl-vinyl)-23,25-dimethoxy-13,19,21,27-tetramethyl-11,28-dioxa-4-aza-tricyclo[22.3.1.0*4,9*]octacos-18-ene-2,3,10,16-tetraone | CHEMBL412791
TypeSmall organic molecule
Emp. Form.C52H76F3NO13
Mol. Mass.980.1539
SMILESCC[C@@H]1\C=C(C)\C[C@H](C)C[C@H](OC)[C@H]2O[C@](O)([C@H](C)C[C@@H]2OC)C(=O)C(=O)N2CCCC[C@H]2C(=O)O[C@@H]([C@H](C)[C@H](O)CC1=O)C(\C)=C\C1CC[C@@H](OC[C@H](O)c2cccc(c2)C(F)(F)F)[C@@H](C1)OC