Reaction Details
TargetAdenosine receptor A2a
LigandBDBM50080288
Substrate/Competitorn/a
Meas. Tech.ChEMBL_30758 (CHEMBL649789)
Ki 23±n/a nM
Citation Campbell, RMCartwright, CChen, WChen, YDuzic, EFu, JMLoveland, MManning, RMcKibben, BPleiman, CMSilverman, LTrueheart, JWebb, DRWilkinson, VWitter, DJXie, XCastelhano, AL Selective A1-adenosine receptor antagonists identified using yeast Saccharomyces cerevisiae functional assays. Bioorg Med Chem Lett9:2413-8 (1999) Adenosine receptor A2a
Name:Adenosine receptor A2a
Type:G Protein-Coupled Receptor (GPCR)
Mol. Mass.:44716.46
Organism:Homo sapiens (Human)
Description:P29274
Residue:412
BDBM50080288
NameBDBM50080288
Synonyms:CHEMBL81616 | N-[2-(5,6-Dimethyl-2-phenyl-7H-pyrrolo[2,3-d]pyrimidin-4-ylamino)-ethyl]-acetamide
TypeSmall organic molecule
Emp. Form.C18H21N5O
Mol. Mass.323.3922
SMILESCC(=O)NCCNc1nc(nc2[nH]c(C)c(C)c12)-c1ccccc1