Reaction Details
TargetAdenosine receptor A1
LigandBDBM50080286
Substrate/Competitorn/a
Meas. Tech.ChEMBL_27911 (CHEMBL642159)
Ki 951±n/a nM
Citation Campbell, RMCartwright, CChen, WChen, YDuzic, EFu, JMLoveland, MManning, RMcKibben, BPleiman, CMSilverman, LTrueheart, JWebb, DRWilkinson, VWitter, DJXie, XCastelhano, AL Selective A1-adenosine receptor antagonists identified using yeast Saccharomyces cerevisiae functional assays. Bioorg Med Chem Lett9:2413-8 (1999) Adenosine receptor A1
Name:Adenosine receptor A1
Type:G Protein-Coupled Receptor (GPCR)
Mol. Mass.:36520.92
Organism:Homo sapiens (Human)
Description:P30542
Residue:326
BDBM50080286
NameBDBM50080286
Synonyms:(S)-2-(5,6-Dimethyl-2-phenyl-7H-pyrrolo[2,3-d]pyrimidin-4-ylamino)-4-methyl-pentan-1-ol | CHEMBL78659
TypeSmall organic molecule
Emp. Form.C20H26N4O
Mol. Mass.338.4466
SMILESCC(C)C[C@@H](CO)Nc1nc(nc2[nH]c(C)c(C)c12)-c1ccccc1