Reaction Details
TargetProthrombin
LigandBDBM50080920
Substrate/Competitorn/a
Meas. Tech.ChEMBL_208527 (CHEMBL873984)
Ki 8±n/a nM
Citation Cody, WLAugelli-Szafran, CEBerryman, KACai, CDoherty, AMEdmunds, JJHe, JXNarasimhan, LSPenvose-Yi, JPlummer, JSRapundalo, STRubin, JRVan Huis, CALeblond, LWinocour, PDSiddiqui, MA The design of potent and selective inhibitors of thrombin utilizing a piperazinedione template: part 2. Bioorg Med Chem Lett9:2503-8 (1999) Prothrombin
Name:Prothrombin
Type:Protein
Mol. Mass.:70029.57
Organism:Homo sapiens (Human)
Description:P00734
Residue:622
BDBM50080920
NameBDBM50080920
Synonyms:CHEMBL313769 | N-[(S)-1-(1-Carbamimidoyl-piperidin-3-ylmethyl)-2-oxo-2-thiazol-2-yl-ethyl]-2-[(R)-2-(3,4-dichloro-benzyl)-3,6-dioxo-4-(3-phenyl-propyl)-piperazin-1-yl]-acetamide
TypeSmall organic molecule
Emp. Form.C34H39Cl2N7O4S
Mol. Mass.712.689
SMILESNC(=N)N1CCCC(C[C@H](NC(=O)CN2[C@H](Cc3ccc(Cl)c(Cl)c3)C(=O)N(CCCc3ccccc3)CC2=O)C(=O)c2nccs2)C1