Reaction Details
TargetOrexin/Hypocretin receptor type 1
LigandBDBM50526573
Substrate/Competitorn/a
Meas. Tech.ChEMBL_1900190 (CHEMBL4402305)
Ki 5.9±n/a nM
Citation Yamamoto, NOhrui, SOkada, TSaitoh, TKutsumura, NNagumo, YIrukayama-Tomobe, YOgawa, YIshikawa, YWatanabe, YHayakawa, DGouda, HYanagisawa, MNagase, H Essential structure of orexin 1 receptor antagonist YNT-707, part III: Role of the 14-hydroxy and the 3-methoxy groups in antagonistic activity toward the orexin 1 receptor in YNT-707 derivatives lacking the 4,5-epoxy ring. Bioorg Med Chem27:1747-1758 (2019) 
 
Orexin/Hypocretin receptor type 1
Name:Orexin/Hypocretin receptor type 1
Type:Protein
Mol. Mass.:47554.50
Organism:Homo sapiens (Human)
Description:O43613
Residue:425
BDBM50526573
NameBDBM50526573
Synonyms:CHEMBL4448949
TypeSmall organic molecule
Emp. Form.C31H32N2O5S
Mol. Mass.544.661
SMILESCOc1ccc2C[C@H]3N(CC[C@@]4(C[C@@H](CC=C34)N(C)C(=O)\C=C\c3ccoc3)c2c1)S(=O)(=O)c1ccccc1