Reaction Details
TargetOrexin/Hypocretin receptor type 1
LigandBDBM50526577
Substrate/Competitorn/a
Meas. Tech.ChEMBL_1900190 (CHEMBL4402305)
Ki 5.5±n/a nM
Citation Yamamoto, NOhrui, SOkada, TSaitoh, TKutsumura, NNagumo, YIrukayama-Tomobe, YOgawa, YIshikawa, YWatanabe, YHayakawa, DGouda, HYanagisawa, MNagase, H Essential structure of orexin 1 receptor antagonist YNT-707, part III: Role of the 14-hydroxy and the 3-methoxy groups in antagonistic activity toward the orexin 1 receptor in YNT-707 derivatives lacking the 4,5-epoxy ring. Bioorg Med Chem27:1747-1758 (2019) 
 
Orexin/Hypocretin receptor type 1
Name:Orexin/Hypocretin receptor type 1
Type:Protein
Mol. Mass.:47554.50
Organism:Homo sapiens (Human)
Description:O43613
Residue:425
BDBM50526577
NameBDBM50526577
Synonyms:CHEMBL4457194
TypeSmall organic molecule
Emp. Form.C31H34N2O5S
Mol. Mass.546.677
SMILES[H][C@@]12CC[C@H](C[C@@]11CCN([C@@H]2Cc2ccc(OC)cc12)S(=O)(=O)c1ccccc1)N(C)C(=O)\C=C\c1ccoc1