Reaction Details
TargetReverse transcriptase/RNaseH
LigandBDBM50081629
Substrate/Competitorn/a
Meas. Tech.ChEMBL_195666 (CHEMBL800661)
IC50 13000±n/a nM
Citation Genin, MJPoel, TJMay, PDKopta, LAYagi, YOlmsted, RAFriis, JMVoorman, RLAdams, WJThomas, RCRomero, DL Synthesis and structure-activity relationships of the (alkylamino)piperidine-containing BHAP class of non-nucleoside reverse transcriptase inhibitors: effect of 3-alkylpyridine ring substitution. J Med Chem42:4140-9 (1999) Reverse transcriptase/RNaseH
Name:Reverse transcriptase/RNaseH
Type:PROTEIN
Mol. Mass.:65229.15
Organism:Human immunodeficiency virus 1
Description:ChEMBL_1473730
Residue:566
BDBM50081629
NameBDBM50081629
Synonyms:2-{[1-(5-Methanesulfonylamino-1H-indole-2-carbonyl)-piperidin-4-yl]-methyl-amino}-nicotinic acid methyl ester | CHEMBL130177
TypeSmall organic molecule
Emp. Form.C23H27N5O5S
Mol. Mass.485.556
SMILESCOC(=O)c1cccnc1N(C)C1CCN(CC1)C(=O)c1cc2cc(NS(C)(=O)=O)ccc2[nH]1