Reaction Details
TargetCollagenase 3
LigandBDBM50063917
Substrate/Competitorn/a
Meas. Tech.ChEBML_101904
IC50 2±n/a nM
Citation Martin, FMBeckett, RPBellamy, CLCourtney, PFDavies, SJDrummond, AHDodd, RPratt, LMPatel, SRRicketts, MLTodd, RSTuffnell, ARWard, JWWhittaker, M The synthesis and biological evaluation of non-peptidic matrix metalloproteinase inhibitors. Bioorg Med Chem Lett9:2887-92 (1999) Collagenase 3
Name:Collagenase 3
Type:Enzyme
Mol. Mass.:53808.06
Organism:Homo sapiens (Human)
Description:P45452
Residue:471
BDBM50063917
NameBDBM50063917
Synonyms:(2S,3R)-N(4)-[(2S)-3,3-dimethyl-1-(methylamino)-1-oxobutan-2-yl]-N(1),2-dihydroxy-3-(2-methylpropyl)butanediamide cid_119031 | marimastat
TypeSmall organic molecule
Emp. Form.C15H29N3O5
Mol. Mass.331.4079
SMILESCNC(=O)[C@@H](NC(=O)[C@H](CC(C)C)[C@H](O)C(=O)NO)C(C)(C)C