Reaction Details
TargetDihydrofolate reductase
LigandBDBM50081912
Substrate/Competitorn/a
Meas. Tech.ChEMBL_53497 (CHEMBL665621)
Ki 75±n/a nM
Citation Chowdhury, SFVillamor, VBGuerrero, RHLeal, IBrun, RCroft, SLGoodman, JMMaes, LRuiz-Perez, LMPacanowska, DGGilbert, IH Design, synthesis, and evaluation of inhibitors of trypanosomal and leishmanial dihydrofolate reductase. J Med Chem42:4300-12 (1999) Dihydrofolate reductase
Name:Dihydrofolate reductase
Type:Enzyme
Mol. Mass.:21453.99
Organism:Homo sapiens (Human)
Description:Recombinant human DHFR.
Residue:187
BDBM50081912
NameBDBM50081912
Synonyms:5-(3-Heptyloxy-benzyl)-6-methyl-pyrimidine-2,4-diamine | CHEMBL138230
TypeSmall organic molecule
Emp. Form.C19H28N4O
Mol. Mass.328.4518
SMILESCCCCCCCOc1cccc(Cc2c(C)nc(N)nc2N)c1