Reaction Details
TargetDihydrofolate reductase
LigandBDBM50081913
Substrate/Competitorn/a
Meas. Tech.ChEMBL_53497 (CHEMBL665621)
Ki 52±n/a nM
Citation Chowdhury, SFVillamor, VBGuerrero, RHLeal, IBrun, RCroft, SLGoodman, JMMaes, LRuiz-Perez, LMPacanowska, DGGilbert, IH Design, synthesis, and evaluation of inhibitors of trypanosomal and leishmanial dihydrofolate reductase. J Med Chem42:4300-12 (1999) Dihydrofolate reductase
Name:Dihydrofolate reductase
Type:Enzyme
Mol. Mass.:21453.99
Organism:Homo sapiens (Human)
Description:Recombinant human DHFR.
Residue:187
BDBM50081913
NameBDBM50081913
Synonyms:5-(3-Decyloxy-benzyl)-pyrimidine-2,4-diamine | CHEMBL334695
TypeSmall organic molecule
Emp. Form.C21H32N4O
Mol. Mass.356.505
SMILESCCCCCCCCCCOc1cccc(Cc2cnc(N)nc2N)c1