Reaction Details
TargetDihydrofolate reductase
LigandBDBM50081918
Substrate/Competitorn/a
Meas. Tech.ChEMBL_53497 (CHEMBL665621)
Ki 6.4±n/a nM
Citation Chowdhury, SFVillamor, VBGuerrero, RHLeal, IBrun, RCroft, SLGoodman, JMMaes, LRuiz-Perez, LMPacanowska, DGGilbert, IH Design, synthesis, and evaluation of inhibitors of trypanosomal and leishmanial dihydrofolate reductase. J Med Chem42:4300-12 (1999) Dihydrofolate reductase
Name:Dihydrofolate reductase
Type:Enzyme
Mol. Mass.:21453.99
Organism:Homo sapiens (Human)
Description:Recombinant human DHFR.
Residue:187
BDBM50081918
NameBDBM50081918
Synonyms:5-(4-Propoxy-benzyl)-pyrimidine-2,4-diamine | CHEMBL326989
TypeSmall organic molecule
Emp. Form.C14H18N4O
Mol. Mass.258.3189
SMILESCCCOc1ccc(Cc2cnc(N)nc2N)cc1