Reaction Details
TargetDihydrofolate reductase
LigandBDBM50081920
Substrate/Competitorn/a
Meas. Tech.ChEMBL_55095 (CHEMBL665356)
Ki 130±n/a nM
Citation Chowdhury, SFVillamor, VBGuerrero, RHLeal, IBrun, RCroft, SLGoodman, JMMaes, LRuiz-Perez, LMPacanowska, DGGilbert, IH Design, synthesis, and evaluation of inhibitors of trypanosomal and leishmanial dihydrofolate reductase. J Med Chem42:4300-12 (1999) Dihydrofolate reductase
Name:Dihydrofolate reductase
Type:Enzyme
Mol. Mass.:21453.99
Organism:Homo sapiens (Human)
Description:Recombinant human DHFR.
Residue:187
BDBM50081920
NameBDBM50081920
Synonyms:5-(3-Propoxy-benzyl)-pyrimidine-2,4-diamine | CHEMBL343127
TypeSmall organic molecule
Emp. Form.C14H18N4O
Mol. Mass.258.3189
SMILESCCCOc1cccc(Cc2cnc(N)nc2N)c1