Reaction Details
TargetDihydrofolate reductase
LigandBDBM50081911
Substrate/Competitorn/a
Meas. Tech.ChEMBL_53497 (CHEMBL665621)
Ki 36±n/a nM
Citation Chowdhury, SFVillamor, VBGuerrero, RHLeal, IBrun, RCroft, SLGoodman, JMMaes, LRuiz-Perez, LMPacanowska, DGGilbert, IH Design, synthesis, and evaluation of inhibitors of trypanosomal and leishmanial dihydrofolate reductase. J Med Chem42:4300-12 (1999) Dihydrofolate reductase
Name:Dihydrofolate reductase
Type:Enzyme
Mol. Mass.:21453.99
Organism:Homo sapiens (Human)
Description:Recombinant human DHFR.
Residue:187
BDBM50081911
NameBDBM50081911
Synonyms:5-(3-Nonyloxy-benzyl)-pyrimidine-2,4-diamine | CHEMBL137641
TypeSmall organic molecule
Emp. Form.C20H30N4O
Mol. Mass.342.4784
SMILESCCCCCCCCCOc1cccc(Cc2cnc(N)nc2N)c1