Reaction Details
Target5-hydroxytryptamine receptor 3A/3B
LigandBDBM50081972
Substrate/Competitorn/a
Meas. Tech.ChEMBL_3181 (CHEMBL617709)
IC50 1.13±n/a nM
Citation Campiani, GMorelli, EGemma, SNacci, VButini, SHamon, MNovellino, EGreco, GCagnotto, AGoegan, MCervo, LDalla Valle, FFracasso, CCaccia, SMennini, T Pyrroloquinoxaline derivatives as high-affinity and selective 5-HT(3) receptor agonists: synthesis, further structure-activity relationships, and biological studies. J Med Chem42:4362-79 (1999) 5-hydroxytryptamine receptor 3A/3B
Name:5-hydroxytryptamine receptor 3A/3B
Type:n/a
Mol. Mass.:n/a
Description:ASSAY_ID of EBI is 2974
Components:This complex has 2 components.
Component 1
Name:5-hydroxytryptamine receptor 3B
Synonyms:5HT3B_RAT Serotonin (5-HT) receptor
Type:PROTEIN
Mol. Mass.:50328.78
Organism:Rattus norvegicus
Description:EBI_11885
Residue:437
Component 2
Name:5-hydroxytryptamine receptor 3A
Synonyms:5-HT3 5HT3A_RAT Htr3 Serotonin (5-HT) receptor | Zacopride site-R
Type:Enzyme Catalytic Domain
Mol. Mass.:55428.70
Organism:RAT
Description:5-HT3 HTR3A RAT::P35563
Residue:483
BDBM50081972
NameBDBM50081972
Synonyms:9-Methyl-4-piperazin-1-yl-pyrrolo[1,2-a]quinoxaline | CHEMBL342690
TypeSmall organic molecule
Emp. Form.C16H18N4
Mol. Mass.266.3409
SMILESCc1cccc2nc(N3CCNCC3)c3cccn3c12