Reaction Details
TargetReverse transcriptase/RNaseH
LigandBDBM50082062
Substrate/Competitorn/a
Meas. Tech.ChEMBL_196183 (CHEMBL801171)
Ki 300±n/a nM
Citation Campiani, GMorelli, EFabbrini, MNacci, VGreco, GNovellino, ERamunno, AMaga, GSpadari, SCaliendo, GBergamini, AFaggioli, EUccella, IBolacchi, FMarini, SColetta, MNacca, ACaccia, S Pyrrolobenzoxazepinone derivatives as non-nucleoside HIV-1 RT inhibitors: further structure-activity relationship studies and identification of more potent broad-spectrum HIV-1 RT inhibitors with antiviral activity. J Med Chem42:4462-70 (1999) Reverse transcriptase/RNaseH
Name:Reverse transcriptase/RNaseH
Type:PROTEIN
Mol. Mass.:65229.15
Organism:Human immunodeficiency virus 1
Description:ChEMBL_1473730
Residue:566
BDBM50082062
NameBDBM50082062
Synonyms:5-Ethyl-5-thiophen-2-yl-6-oxa-10b-aza-benzo[e]azulen-4-one | CHEMBL141223
TypeSmall organic molecule
Emp. Form.C18H15NO2S
Mol. Mass.309.382
SMILESCCC1(Oc2ccccc2-n2cccc2C1=O)c1cccs1