Reaction Details
TargetMatrix metalloproteinase-9
LigandBDBM50082220
Substrate/Competitorn/a
Meas. Tech.ChEBML_105820
IC50 850±n/a nM
Citation Bailey, SBolognese, BFaller, ALouis-Flamberg, PMacPherson, DTMayer, RJMarshall, LAMilner, PHMistry, JSmith, DGWard, JG Selective inhibition of low affinity IgE receptor (CD23) processing: P1' bicyclomethyl substituents. Bioorg Med Chem Lett9:3165-70 (1999) Matrix metalloproteinase-9
Name:Matrix metalloproteinase-9
Type:Enzyme
Mol. Mass.:78452.28
Organism:Homo sapiens (Human)
Description:P14780
Residue:707
BDBM50082220
NameBDBM50082220
Synonyms:(2R,3S)-N*1*-((S)-1-Carbamoyl-2-phenyl-ethyl)-2-(6-fluoro-naphthalen-2-ylmethyl)-3,N*4*-dihydroxy-succinamide | CHEMBL108412
TypeSmall organic molecule
Emp. Form.C24H24FN3O5
Mol. Mass.453.4629
SMILESNC(=O)[C@H](Cc1ccccc1)NC(=O)[C@H](Cc1ccc2cc(F)ccc2c1)[C@H](O)C(=O)NO