Reaction Details
TargetLow affinity immunoglobulin epsilon Fc receptor
LigandBDBM50082224
Substrate/Competitorn/a
Meas. Tech.ChEBML_88888
IC50 760±n/a nM
Citation Bailey, SBolognese, BFaller, ALouis-Flamberg, PMacPherson, DTMayer, RJMarshall, LAMilner, PHMistry, JSmith, DGWard, JG Selective inhibition of low affinity IgE receptor (CD23) processing: P1' bicyclomethyl substituents. Bioorg Med Chem Lett9:3165-70 (1999) Low affinity immunoglobulin epsilon Fc receptor
Name:Low affinity immunoglobulin epsilon Fc receptor
Type:PROTEIN
Mol. Mass.:36461.84
Organism:Homo sapiens (Human)
Description:ChEMBL_88888
Residue:321
BDBM50082224
NameBDBM50082224
Synonyms:(2R,3S)-N*4*-((S)-1-Carbamoyl-2-phenyl-ethyl)-2,N*1*-dihydroxy-3-(7-hydroxy-naphthalen-2-ylmethyl)-succinamide | CHEMBL106444
TypeSmall organic molecule
Emp. Form.C24H25N3O6
Mol. Mass.451.4718
SMILESNC(=O)[C@H](Cc1ccccc1)NC(=O)[C@H](Cc1ccc2ccc(O)cc2c1)[C@H](O)C(=O)NO