Reaction Details
TargetLow affinity immunoglobulin epsilon Fc receptor
LigandBDBM50082228
Substrate/Competitorn/a
Meas. Tech.ChEBML_88888
IC50 1000±n/a nM
Citation Bailey, SBolognese, BFaller, ALouis-Flamberg, PMacPherson, DTMayer, RJMarshall, LAMilner, PHMistry, JSmith, DGWard, JG Selective inhibition of low affinity IgE receptor (CD23) processing: P1' bicyclomethyl substituents. Bioorg Med Chem Lett9:3165-70 (1999) Low affinity immunoglobulin epsilon Fc receptor
Name:Low affinity immunoglobulin epsilon Fc receptor
Type:PROTEIN
Mol. Mass.:36461.84
Organism:Homo sapiens (Human)
Description:ChEMBL_88888
Residue:321
BDBM50082228
NameBDBM50082228
Synonyms:(2R,3S)-N*4*-((S)-1-Carbamoyl-2,2-dimethyl-propyl)-2,N*1*-dihydroxy-3-quinolin-6-ylmethyl-succinamide | CHEMBL106233
TypeSmall organic molecule
Emp. Form.C20H26N4O5
Mol. Mass.402.4442
SMILESCC(C)(C)[C@H](NC(=O)[C@H](Cc1ccc2ncccc2c1)[C@H](O)C(=O)NO)C(N)=O