Reaction Details
TargetIntegrin alpha-IIb/beta-3
LigandBDBM50082933
Substrate/Competitorn/a
Meas. Tech.ChEMBL_218210 (CHEMBL824380)
IC50 2±n/a nM
Citation Fisher, MJArfstan, AEGiese, UGunn, BPHarms, CSKhau, VKinnick, MDLindstrom, TDMartinelli, MJMest, HJMohr, MMorin, JMMullaney, JTNunes, APaal, MRapp, ARühter, GRuterbories, KJSall, DJScarborough, RMSchotten, TSommer, BStenzel, WTowner, RDUm, SL Fused bicyclic Gly-Asp beta-turn mimics with specific affinity for GPIIb-IIIa. J Med Chem42:4875-89 (1999) Integrin alpha-IIb/beta-3
Name:Integrin alpha-IIb/beta-3
Synonyms:Glycoprotein IIb/IIIa
Type:n/a
Mol. Mass.:n/a
Description:ASSAY_ID of EBI is 30109
Components:This complex has 2 components.
Component 1
Name:Integrin beta-3
Type:Protein
Mol. Mass.:87038.91
Organism:Homo sapiens (Human)
Description:P05106
Residue:788
Component 2
Name:Integrin alpha-IIb
Synonyms:CD_antigen=CD41 GPIIb Glycoprotein IIb ITGA2B Integrin alpha-IIb heavy chain Integrin alpha-IIb light chain, form 2 Integrin alpha-V/beta-3 and alpha-IIb/beta 3 | Platelet membrane glycoprotein IIb
Type:Protein
Mol. Mass.:113354.85
Organism:Homo sapiens (Human)
Description:P08514
Residue:1039
BDBM50082933
NameBDBM50082933
Synonyms:CHEMBL323720 | [6-(4-Carbamimidoyl-benzoylamino)-chroman-2-yl]-acetic acid
TypeSmall organic molecule
Emp. Form.C19H19N3O4
Mol. Mass.353.3719
SMILESNC(=N)c1ccc(cc1)C(=O)Nc1ccc2OC(CC(O)=O)CCc2c1